{"text_format":"1","workbook":"xlsx","n_sheets":5,"sheets":["Disclosures","Engine","Inputs","Calculations","Summary"],"not_rendered":{"charts":0,"images":0,"macros":1,"external_links":0,"defined_names":31,"comments":0,"pivot_tables":0},"unopened":[],"bounds":{"document_bytes":16777216,"sheet_cells":100000,"rows_first":2000,"rows_last":500,"rows_between":2000,"halvings":0,"cell_chars":16384,"cell_head_chars":4096},"cells_cut":0,"cells_raw":0,"read":"whole","date_system":"1900"}

{"sheet":"Disclosures","index":0,"n_rows":13,"n_cols":1,"rows_kept":13,"cut":false,"hidden":false,"merged":[]}
["Important Disclosures"]
[]
["Purpose of the tool. "]
["This tool is provided for general informational purposes only. It’s designed to help you estimate potential deferrals under BorgWarner’s retirement plans. It does not provide financial, investment, or tax advice, and does not consider your individual circumstances beyond the limited data shown. You may wish to consult with your personal tax or financial adviser before making any elections."]
[]
["How estimates are determined. "]
["The results generated by this tool are estimates only and are based on assumptions, preset formulas, and the information provided. Actual outcomes may differ, and errors are possible. If there is any inconsistency between the information produced by this tool and the terms of the applicable plan documents, the plan documents will control."]
[]
["Excess Plan considerations."]
["Participation in any plan involves risk, and future outcomes cannot be guaranteed. Amounts deferred under the Excess Plan are unsecured obligations of the company and are subject to the claims of the company’s general creditors."]
{"$rows_left_out":4}
{"sheet":"Engine","index":1,"n_rows":14,"n_cols":7,"rows_kept":14,"cut":false,"hidden":true,"merged":[]}
["Current Year Inputs",null,null,"CRC Inputs"]
["1st Payroll:",46037,null,"Years of Service","Under FICA","Above FICA","Effective Date"]
["401(a)(17) Comp Limit:",360000,null,0,0.04,0.08,{"$f":"DATE(YEAR(DOH)+CRC_Table[[#This Row],[Years of Service]],MONTH(DOH),DAY(DOH))","v":0}]
["402(g) Deferral Limit:",24500,null,10,0.05,0.1,{"$f":"DATE(YEAR(DOH)+CRC_Table[[#This Row],[Years of Service]],MONTH(DOH),DAY(DOH))","v":3653}]
["414(v) Catch-up Limit Pre 60:",8000,null,20,0.06,0.115,{"$f":"DATE(YEAR(DOH)+CRC_Table[[#This Row],[Years of Service]],MONTH(DOH),DAY(DOH))","v":7305}]
["414(v) Catch-up Limit 60 - 63:",11250]
["415(c) Annual Additions Limit:",72000,null,"Calculation Inputs"]
["FICA Taxable Wage Base:",184500,null,"Age for Catch-up:",{"$f":"YEAR(Starting_Payroll)-YEAR(DOB)","v":126}]
["FICA Catch-up Required Wage:",150000,null,"414(v) Catch-up Limit:",{"$f":"IF(E8<50,0,IF(AND(E8>=60,E8<64),Catch_Up_Limit_Post,Catch_Up_Limit_Pre))","v":8000}]
[null,null,null,"Annual Additions Limit:",{"$f":"Regulatory_Additions_Limit+Catch_Up_Limit","v":80000}]
{"$rows_left_out":5}
{"sheet":"Inputs","index":2,"n_rows":54,"n_cols":8,"rows_kept":54,"cut":false,"hidden":false,"merged":[[1,1,1,3]]}
["Instructions"]
[1,"Click \"Enable Content\" at top of screen or via\nFile > Info > Security Warning to allow Macros."]
[2,"Fill out user inputs below."]
[]
[null,"*Required User Input"]
[]
[null,"*Optional User Input"]
[]
[3,"Review pay period calculations via 'Calculations' tab."]
["4a","Review annual projection totals via 'Summary' tab."]
{"$rows_left_out":45}
{"sheet":"Calculations","index":3,"n_rows":27,"n_cols":25,"rows_kept":27,"cut":false,"hidden":false,"merged":[]}
["Payroll","Pay Period","Periodic Compensation","YTD Compensation","401(a)(17) Limited  YTD Compensation","Plan Eligible\nPeriodic Compensation","Savings B/Tax \nPeriodic Deferral","Roth A/Tax\nPeriodic Deferral","YTD Deferral","Savings B/Tax \nCatch-Up\nPeriodic Deferral","Roth A/Tax\nCatch-Up\nPeriodic Deferral","Total\nCatch-Up\nPeriodic Deferral","YTD Catch-Up","Savings Plan\nPeriodic Company Match","Savings Plan\nYTD Company Match","Excess Plan\nPeriodic Company Match","Excess Plan\nYTD Company Match","CRC Qualified Periodic\nSafe Harbor","CRC Qualified\nPeriodic Regular","CRC Qualified\nPeriodic Total","CRC Qualified\nYTD Total","CRC\nExcess Plan Periodic Total","Savings A/Tax \nPeriodic Deferral","Savings A/Tax \nYTD Deferral","Total \nYTD Additions"]
[1,{"$f":"Starting_Payroll","v":46037},{"$f":"IF(DOH>B2,0,IF(A2=\"Bonus\",Bonus_Amt,IF(B2<Comp_Eff_Date_2,Base_Comp_1,Base_Comp_2)))","v":0},{"$f":"SUM($C$2:C2)","v":0},{"$f":"IF(D2>=Compensation_Limit,Compensation_Limit,D2)","v":0},{"$f":"E2-IF(A2=1,0,E1)","v":0},{"$f":"MIN(_xlfn.XLOOKUP(B2,Inputs!$B$30:$B$54,Inputs!$D$30:$D$54)*F2,Deferral_Limit-IF(A2=1,0,I1),Annual_Additions_Limit-IF(A2=1,0,Y1))","v":0},{"$f":"MIN(_xlfn.XLOOKUP(B2,Inputs!$B$30:$B$54,Inputs!$F$30:$F$54)*F2,Deferral_Limit-IF(A2=1,0,I1)-G2,Annual_Additions_Limit-IF(A2=1,0,Y1)-G2)","v":0},{"$f":"SUM($G$2:H2)","v":0},{"$f":"IF(Prior_Yr_HCE_Indic=\"Yes\",0,MIN(_xlfn.XLOOKUP(B2,Inputs!$B$30:$B$54,Inputs!$D$30:$D$54)*F2-G2,M2-IF(A2=1,0,M1)))","v":0},{"$f":"M2-IF(A2=1,0,M1)-J2","v":0},{"$f":"MAX(MIN(F2*(_xlfn.XLOOKUP(B2,Inputs!$B$30:$B$54,Inputs!$D$30:$D$54)+IF((Prior_Yr_HCE_Indic=\"Yes\")*(_xlfn.XLOOKUP(B2,Inputs!$B$30:$B$54,Inputs!$D$30:$D$54)>0),0,_xlfn.XLOOKUP(B2,Inputs!$B$30:$B$54,Inputs!$F$30:$F$54)))-(G2+H2),Catch_Up_Limit-IF(A2=1,0,M1),Annual_Additions_Limit-IF(A2=1,0,Y1)-G2-H2),0)","v":0},{"$f":"SUM($L$2:L2)","v":0},{"$f":"MIN(MIN(IFERROR((G2+H2+J2+K2)/F2,0),Match_Tier_1)*Match_Tier_1_Perc*F2,Annual_Additions_Limit-IF(A2=1,0,Y1)-G2-H2-L2)","v":0},{"$f":"SUM($N$2:N2)","v":0},{"$f":"MAX(IF(Excess_Plan_Elig=\"No\",0,(MIN(IFERROR((G2+H2+L2+IF(Excess_Plan_Elig=\"No\",0,MAX(C2*(_xlfn.XLOOKUP(B2,Inputs!$B$30:$B$54,Inputs!$D$30:$D$54)+IF((Prior_Yr_HCE_Indic=\"Yes\")*(_xlfn.XLOOKUP(B2,Inputs!$B$30:$B$54,Inputs!$D$30:$D$54)>0)*(M2>0),0,_xlfn.XLOOKUP(B2,Inputs!$B$30:$B$54,Inputs!$F$30:$F$54)))-(G2+H2)-L2,0)))/C2,0),Match_Tier_1)*Match_Tier_1_Perc*C2))-N2,0)","v":0},{"$f":"SUM($P$2:P2)","v":0},{"$f":"IF(CRC_Start_Date>B2,0,MIN(CRC_Safe_Harbor_Perc*F2,Annual_Additions_Limit-IF(A2=1,0,Y1)-G2-H2-L2-N2))","v":0},{"$f":"T2-R2","v":0},{"$f":"IF(CRC_Start_Date>B2,0,MIN(IF(E2<=FICA_Tax_Base,F2*Under_FICA_Perc,IF(E2-F2>FICA_Tax_Base,F2*Above_FICA_Perc,((FICA_Tax_Base-(E2-F2))*Under_FICA_Perc)+(E2-FICA_Tax_Base)*Above_FICA_Perc)),Annual_Additions_Limit-IF(A2=1,0,Y1)-G2-H2-L2-N2))","v":0},{"$f":"SUM($T$2:T2)","v":0},{"$f":"IF(CRC_Start_Date>B2,0,IF(D2<=FICA_Tax_Base,C2*Under_FICA_Perc,IF(D2-C2>FICA_Tax_Base,C2*Above_FICA_Perc,((FICA_Tax_Base-(D2-C2))*Under_FICA_Perc)+(D2-FICA_Tax_Base)*Above_FICA_Perc))-T2)","v":0},{"$f":"MIN(_xlfn.XLOOKUP(B2,Inputs!$B$30:$B$54,Inputs!$H$30:$H$54)*F2,Annual_Additions_Limit-IF(A2=1,0,Y1)-G2-H2-L2-N2-T2)","v":0},{"$f":"SUM($W$2:W2)","v":0},{"$f":"I2+M2+O2+U2+X2","v":0}]
[2,{"$f":"IF(DAY(B2)=15,\nEOMONTH(B2,0),\nDATE(YEAR(B2),MONTH(B2)+1,15))","v":46053},{"$f":"IF(DOH>B3,0,IF(A3=\"Bonus\",Bonus_Amt,IF(B3<Comp_Eff_Date_2,Base_Comp_1,Base_Comp_2)))","v":0},{"$f":"SUM($C$2:C3)","v":0},{"$f":"IF(D3>=Compensation_Limit,Compensation_Limit,D3)","v":0},{"$f":"E3-IF(A3=1,0,E2)","v":0},{"$f":"MIN(_xlfn.XLOOKUP(B3,Inputs!$B$30:$B$54,Inputs!$D$30:$D$54)*F3,Deferral_Limit-IF(A3=1,0,I2),Annual_Additions_Limit-IF(A3=1,0,Y2))","v":0},{"$f":"MIN(_xlfn.XLOOKUP(B3,Inputs!$B$30:$B$54,Inputs!$F$30:$F$54)*F3,Deferral_Limit-IF(A3=1,0,I2)-G3,Annual_Additions_Limit-IF(A3=1,0,Y2)-G3)","v":0},{"$f":"SUM($G$2:H3)","v":0},{"$f":"IF(Prior_Yr_HCE_Indic=\"Yes\",0,MIN(_xlfn.XLOOKUP(B3,Inputs!$B$30:$B$54,Inputs!$D$30:$D$54)*F3-G3,M3-IF(A3=1,0,M2)))","v":0},{"$f":"M3-IF(A3=1,0,M2)-J3","v":0},{"$f":"MAX(MIN(F3*(_xlfn.XLOOKUP(B3,Inputs!$B$30:$B$54,Inputs!$D$30:$D$54)+IF((Prior_Yr_HCE_Indic=\"Yes\")*(_xlfn.XLOOKUP(B3,Inputs!$B$30:$B$54,Inputs!$D$30:$D$54)>0),0,_xlfn.XLOOKUP(B3,Inputs!$B$30:$B$54,Inputs!$F$30:$F$54)))-(G3+H3),Catch_Up_Limit-IF(A3=1,0,M2),Annual_Additions_Limit-IF(A3=1,0,Y2)-G3-H3),0)","v":0},{"$f":"SUM($L$2:L3)","v":0},0,{"$f":"SUM($N$2:N3)","v":0},{"$f":"MAX(IF(Excess_Plan_Elig=\"No\",0,(MIN(IFERROR((G3+H3+L3+IF(Excess_Plan_Elig=\"No\",0,MAX(C3*(_xlfn.XLOOKUP(B3,Inputs!$B$30:$B$54,Inputs!$D$30:$D$54)+IF((Prior_Yr_HCE_Indic=\"Yes\")*(_xlfn.XLOOKUP(B3,Inputs!$B$30:$B$54,Inputs!$D$30:$D$54)>0)*(M3>0),0,_xlfn.XLOOKUP(B3,Inputs!$B$30:$B$54,Inputs!$F$30:$F$54)))-(G3+H3)-L3,0)))/C3,0),Match_Tier_1)*Match_Tier_1_Perc*C3))-N3,0)","v":0},{"$f":"SUM($P$2:P3)","v":0},0,{"$f":"T3-R3","v":0},0,{"$f":"SUM($T$2:T3)","v":0},0,{"$f":"MIN(_xlfn.XLOOKUP(B3,Inputs!$B$30:$B$54,Inputs!$H$30:$H$54)*F3,Annual_Additions_Limit-IF(A3=1,0,Y2)-G3-H3-L3-N3-T3)","v":0},{"$f":"SUM($W$2:W3)","v":0},{"$f":"I3+M3+O3+U3+X3","v":0}]
[3,{"$f":"IF(DAY(B3)=15,\nEOMONTH(B3,0),\nDATE(YEAR(B3),MONTH(B3)+1,15))","v":46068},0,{"$f":"SUM($C$2:C4)","v":0},0,0,{"$f":"MIN(_xlfn.XLOOKUP(B4,Inputs!$B$30:$B$54,Inputs!$D$30:$D$54)*F4,Deferral_Limit-IF(A4=1,0,I3),Annual_Additions_Limit-IF(A4=1,0,Y3))","v":0},{"$f":"MIN(_xlfn.XLOOKUP(B4,Inputs!$B$30:$B$54,Inputs!$F$30:$F$54)*F4,Deferral_Limit-IF(A4=1,0,I3)-G4,Annual_Additions_Limit-IF(A4=1,0,Y3)-G4)","v":0},{"$f":"SUM($G$2:H4)","v":0},{"$f":"IF(Prior_Yr_HCE_Indic=\"Yes\",0,MIN(_xlfn.XLOOKUP(B4,Inputs!$B$30:$B$54,Inputs!$D$30:$D$54)*F4-G4,M4-IF(A4=1,0,M3)))","v":0},0,{"$f":"MAX(MIN(F4*(_xlfn.XLOOKUP(B4,Inputs!$B$30:$B$54,Inputs!$D$30:$D$54)+IF((Prior_Yr_HCE_Indic=\"Yes\")*(_xlfn.XLOOKUP(B4,Inputs!$B$30:$B$54,Inputs!$D$30:$D$54)>0),0,_xlfn.XLOOKUP(B4,Inputs!$B$30:$B$54,Inputs!$F$30:$F$54)))-(G4+H4),Catch_Up_Limit-IF(A4=1,0,M3),Annual_Additions_Limit-IF(A4=1,0,Y3)-G4-H4),0)","v":0},{"$f":"SUM($L$2:L4)","v":0},0,{"$f":"SUM($N$2:N4)","v":0},{"$f":"MAX(IF(Excess_Plan_Elig=\"No\",0,(MIN(IFERROR((G4+H4+L4+IF(Excess_Plan_Elig=\"No\",0,MAX(C4*(_xlfn.XLOOKUP(B4,Inputs!$B$30:$B$54,Inputs!$D$30:$D$54)+IF((Prior_Yr_HCE_Indic=\"Yes\")*(_xlfn.XLOOKUP(B4,Inputs!$B$30:$B$54,Inputs!$D$30:$D$54)>0)*(M4>0),0,_xlfn.XLOOKUP(B4,Inputs!$B$30:$B$54,Inputs!$F$30:$F$54)))-(G4+H4)-L4,0)))/C4,0),Match_Tier_1)*Match_Tier_1_Perc*C4))-N4,0)","v":0},{"$f":"SUM($P$2:P4)","v":0},0,0,0,{"$f":"SUM($T$2:T4)","v":0},0,{"$f":"MIN(_xlfn.XLOOKUP(B4,Inputs!$B$30:$B$54,Inputs!$H$30:$H$54)*F4,Annual_Additions_Limit-IF(A4=1,0,Y3)-G4-H4-L4-N4-T4)","v":0},{"$f":"SUM($W$2:W4)","v":0},0]
["Bonus",{"$f":"B4+2","v":46070},0,{"$f":"SUM($C$2:C5)","v":0},0,0,{"$f":"MIN(_xlfn.XLOOKUP(B5,Inputs!$B$30:$B$54,Inputs!$D$30:$D$54)*F5,Deferral_Limit-IF(A5=1,0,I4),Annual_Additions_Limit-IF(A5=1,0,Y4))","v":0},{"$f":"MIN(_xlfn.XLOOKUP(B5,Inputs!$B$30:$B$54,Inputs!$F$30:$F$54)*F5,Deferral_Limit-IF(A5=1,0,I4)-G5,Annual_Additions_Limit-IF(A5=1,0,Y4)-G5)","v":0},{"$f":"SUM($G$2:H5)","v":0},{"$f":"IF(Prior_Yr_HCE_Indic=\"Yes\",0,MIN(_xlfn.XLOOKUP(B5,Inputs!$B$30:$B$54,Inputs!$D$30:$D$54)*F5-G5,M5-IF(A5=1,0,M4)))","v":0},0,{"$f":"MAX(MIN(F5*(_xlfn.XLOOKUP(B5,Inputs!$B$30:$B$54,Inputs!$D$30:$D$54)+IF((Prior_Yr_HCE_Indic=\"Yes\")*(_xlfn.XLOOKUP(B5,Inputs!$B$30:$B$54,Inputs!$D$30:$D$54)>0),0,_xlfn.XLOOKUP(B5,Inputs!$B$30:$B$54,Inputs!$F$30:$F$54)))-(G5+H5),Catch_Up_Limit-IF(A5=1,0,M4),Annual_Additions_Limit-IF(A5=1,0,Y4)-G5-H5),0)","v":0},{"$f":"SUM($L$2:L5)","v":0},0,{"$f":"SUM($N$2:N5)","v":0},{"$f":"MAX(IF(Excess_Plan_Elig=\"No\",0,(MIN(IFERROR((G5+H5+L5+IF(Excess_Plan_Elig=\"No\",0,MAX(C5*(_xlfn.XLOOKUP(B5,Inputs!$B$30:$B$54,Inputs!$D$30:$D$54)+IF((Prior_Yr_HCE_Indic=\"Yes\")*(_xlfn.XLOOKUP(B5,Inputs!$B$30:$B$54,Inputs!$D$30:$D$54)>0)*(M5>0),0,_xlfn.XLOOKUP(B5,Inputs!$B$30:$B$54,Inputs!$F$30:$F$54)))-(G5+H5)-L5,0)))/C5,0),Match_Tier_1)*Match_Tier_1_Perc*C5))-N5,0)","v":0},{"$f":"SUM($P$2:P5)","v":0},0,0,0,{"$f":"SUM($T$2:T5)","v":0},0,{"$f":"MIN(_xlfn.XLOOKUP(B5,Inputs!$B$30:$B$54,Inputs!$H$30:$H$54)*F5,Annual_Additions_Limit-IF(A5=1,0,Y4)-G5-H5-L5-N5-T5)","v":0},{"$f":"SUM($W$2:W5)","v":0},0]
[4,{"$f":"IF(DAY(B4)=15,\nEOMONTH(B4,0),\nDATE(YEAR(B4),MONTH(B4)+1,15))","v":46081},0,{"$f":"SUM($C$2:C6)","v":0},0,0,{"$f":"MIN(_xlfn.XLOOKUP(B6,Inputs!$B$30:$B$54,Inputs!$D$30:$D$54)*F6,Deferral_Limit-IF(A6=1,0,I5),Annual_Additions_Limit-IF(A6=1,0,Y5))","v":0},{"$f":"MIN(_xlfn.XLOOKUP(B6,Inputs!$B$30:$B$54,Inputs!$F$30:$F$54)*F6,Deferral_Limit-IF(A6=1,0,I5)-G6,Annual_Additions_Limit-IF(A6=1,0,Y5)-G6)","v":0},{"$f":"SUM($G$2:H6)","v":0},{"$f":"IF(Prior_Yr_HCE_Indic=\"Yes\",0,MIN(_xlfn.XLOOKUP(B6,Inputs!$B$30:$B$54,Inputs!$D$30:$D$54)*F6-G6,M6-IF(A6=1,0,M5)))","v":0},0,{"$f":"MAX(MIN(F6*(_xlfn.XLOOKUP(B6,Inputs!$B$30:$B$54,Inputs!$D$30:$D$54)+IF((Prior_Yr_HCE_Indic=\"Yes\")*(_xlfn.XLOOKUP(B6,Inputs!$B$30:$B$54,Inputs!$D$30:$D$54)>0),0,_xlfn.XLOOKUP(B6,Inputs!$B$30:$B$54,Inputs!$F$30:$F$54)))-(G6+H6),Catch_Up_Limit-IF(A6=1,0,M5),Annual_Additions_Limit-IF(A6=1,0,Y5)-G6-H6),0)","v":0},{"$f":"SUM($L$2:L6)","v":0},0,{"$f":"SUM($N$2:N6)","v":0},{"$f":"MAX(IF(Excess_Plan_Elig=\"No\",0,(MIN(IFERROR((G6+H6+L6+IF(Excess_Plan_Elig=\"No\",0,MAX(C6*(_xlfn.XLOOKUP(B6,Inputs!$B$30:$B$54,Inputs!$D$30:$D$54)+IF((Prior_Yr_HCE_Indic=\"Yes\")*(_xlfn.XLOOKUP(B6,Inputs!$B$30:$B$54,Inputs!$D$30:$D$54)>0)*(M6>0),0,_xlfn.XLOOKUP(B6,Inputs!$B$30:$B$54,Inputs!$F$30:$F$54)))-(G6+H6)-L6,0)))/C6,0),Match_Tier_1)*Match_Tier_1_Perc*C6))-N6,0)","v":0},{"$f":"SUM($P$2:P6)","v":0},0,0,0,{"$f":"SUM($T$2:T6)","v":0},0,{"$f":"MIN(_xlfn.XLOOKUP(B6,Inputs!$B$30:$B$54,Inputs!$H$30:$H$54)*F6,Annual_Additions_Limit-IF(A6=1,0,Y5)-G6-H6-L6-N6-T6)","v":0},{"$f":"SUM($W$2:W6)","v":0},0]
[5,{"$f":"IF(DAY(B6)=15,\nEOMONTH(B6,0),\nDATE(YEAR(B6),MONTH(B6)+1,15))","v":46096},0,{"$f":"SUM($C$2:C7)","v":0},0,0,{"$f":"MIN(_xlfn.XLOOKUP(B7,Inputs!$B$30:$B$54,Inputs!$D$30:$D$54)*F7,Deferral_Limit-IF(A7=1,0,I6),Annual_Additions_Limit-IF(A7=1,0,Y6))","v":0},{"$f":"MIN(_xlfn.XLOOKUP(B7,Inputs!$B$30:$B$54,Inputs!$F$30:$F$54)*F7,Deferral_Limit-IF(A7=1,0,I6)-G7,Annual_Additions_Limit-IF(A7=1,0,Y6)-G7)","v":0},{"$f":"SUM($G$2:H7)","v":0},{"$f":"IF(Prior_Yr_HCE_Indic=\"Yes\",0,MIN(_xlfn.XLOOKUP(B7,Inputs!$B$30:$B$54,Inputs!$D$30:$D$54)*F7-G7,M7-IF(A7=1,0,M6)))","v":0},0,{"$f":"MAX(MIN(F7*(_xlfn.XLOOKUP(B7,Inputs!$B$30:$B$54,Inputs!$D$30:$D$54)+IF((Prior_Yr_HCE_Indic=\"Yes\")*(_xlfn.XLOOKUP(B7,Inputs!$B$30:$B$54,Inputs!$D$30:$D$54)>0),0,_xlfn.XLOOKUP(B7,Inputs!$B$30:$B$54,Inputs!$F$30:$F$54)))-(G7+H7),Catch_Up_Limit-IF(A7=1,0,M6),Annual_Additions_Limit-IF(A7=1,0,Y6)-G7-H7),0)","v":0},{"$f":"SUM($L$2:L7)","v":0},0,{"$f":"SUM($N$2:N7)","v":0},{"$f":"MAX(IF(Excess_Plan_Elig=\"No\",0,(MIN(IFERROR((G7+H7+L7+IF(Excess_Plan_Elig=\"No\",0,MAX(C7*(_xlfn.XLOOKUP(B7,Inputs!$B$30:$B$54,Inputs!$D$30:$D$54)+IF((Prior_Yr_HCE_Indic=\"Yes\")*(_xlfn.XLOOKUP(B7,Inputs!$B$30:$B$54,Inputs!$D$30:$D$54)>0)*(M7>0),0,_xlfn.XLOOKUP(B7,Inputs!$B$30:$B$54,Inputs!$F$30:$F$54)))-(G7+H7)-L7,0)))/C7,0),Match_Tier_1)*Match_Tier_1_Perc*C7))-N7,0)","v":0},{"$f":"SUM($P$2:P7)","v":0},0,0,0,{"$f":"SUM($T$2:T7)","v":0},0,{"$f":"MIN(_xlfn.XLOOKUP(B7,Inputs!$B$30:$B$54,Inputs!$H$30:$H$54)*F7,Annual_Additions_Limit-IF(A7=1,0,Y6)-G7-H7-L7-N7-T7)","v":0},{"$f":"SUM($W$2:W7)","v":0},0]
[6,46112,0,{"$f":"SUM($C$2:C8)","v":0},0,0,{"$f":"MIN(_xlfn.XLOOKUP(B8,Inputs!$B$30:$B$54,Inputs!$D$30:$D$54)*F8,Deferral_Limit-IF(A8=1,0,I7),Annual_Additions_Limit-IF(A8=1,0,Y7))","v":0},{"$f":"MIN(_xlfn.XLOOKUP(B8,Inputs!$B$30:$B$54,Inputs!$F$30:$F$54)*F8,Deferral_Limit-IF(A8=1,0,I7)-G8,Annual_Additions_Limit-IF(A8=1,0,Y7)-G8)","v":0},{"$f":"SUM($G$2:H8)","v":0},{"$f":"IF(Prior_Yr_HCE_Indic=\"Yes\",0,MIN(_xlfn.XLOOKUP(B8,Inputs!$B$30:$B$54,Inputs!$D$30:$D$54)*F8-G8,M8-IF(A8=1,0,M7)))","v":0},0,{"$f":"MAX(MIN(F8*(_xlfn.XLOOKUP(B8,Inputs!$B$30:$B$54,Inputs!$D$30:$D$54)+IF((Prior_Yr_HCE_Indic=\"Yes\")*(_xlfn.XLOOKUP(B8,Inputs!$B$30:$B$54,Inputs!$D$30:$D$54)>0),0,_xlfn.XLOOKUP(B8,Inputs!$B$30:$B$54,Inputs!$F$30:$F$54)))-(G8+H8),Catch_Up_Limit-IF(A8=1,0,M7),Annual_Additions_Limit-IF(A8=1,0,Y7)-G8-H8),0)","v":0},{"$f":"SUM($L$2:L8)","v":0},0,{"$f":"SUM($N$2:N8)","v":0},{"$f":"MAX(IF(Excess_Plan_Elig=\"No\",0,(MIN(IFERROR((G8+H8+L8+IF(Excess_Plan_Elig=\"No\",0,MAX(C8*(_xlfn.XLOOKUP(B8,Inputs!$B$30:$B$54,Inputs!$D$30:$D$54)+IF((Prior_Yr_HCE_Indic=\"Yes\")*(_xlfn.XLOOKUP(B8,Inputs!$B$30:$B$54,Inputs!$D$30:$D$54)>0)*(M8>0),0,_xlfn.XLOOKUP(B8,Inputs!$B$30:$B$54,Inputs!$F$30:$F$54)))-(G8+H8)-L8,0)))/C8,0),Match_Tier_1)*Match_Tier_1_Perc*C8))-N8,0)","v":0},{"$f":"SUM($P$2:P8)","v":0},0,0,0,{"$f":"SUM($T$2:T8)","v":0},0,{"$f":"MIN(_xlfn.XLOOKUP(B8,Inputs!$B$30:$B$54,Inputs!$H$30:$H$54)*F8,Annual_Additions_Limit-IF(A8=1,0,Y7)-G8-H8-L8-N8-T8)","v":0},{"$f":"SUM($W$2:W8)","v":0},0]
[7,46127,0,{"$f":"SUM($C$2:C9)","v":0},0,0,{"$f":"MIN(_xlfn.XLOOKUP(B9,Inputs!$B$30:$B$54,Inputs!$D$30:$D$54)*F9,Deferral_Limit-IF(A9=1,0,I8),Annual_Additions_Limit-IF(A9=1,0,Y8))","v":0},{"$f":"MIN(_xlfn.XLOOKUP(B9,Inputs!$B$30:$B$54,Inputs!$F$30:$F$54)*F9,Deferral_Limit-IF(A9=1,0,I8)-G9,Annual_Additions_Limit-IF(A9=1,0,Y8)-G9)","v":0},{"$f":"SUM($G$2:H9)","v":0},{"$f":"IF(Prior_Yr_HCE_Indic=\"Yes\",0,MIN(_xlfn.XLOOKUP(B9,Inputs!$B$30:$B$54,Inputs!$D$30:$D$54)*F9-G9,M9-IF(A9=1,0,M8)))","v":0},0,{"$f":"MAX(MIN(F9*(_xlfn.XLOOKUP(B9,Inputs!$B$30:$B$54,Inputs!$D$30:$D$54)+IF((Prior_Yr_HCE_Indic=\"Yes\")*(_xlfn.XLOOKUP(B9,Inputs!$B$30:$B$54,Inputs!$D$30:$D$54)>0),0,_xlfn.XLOOKUP(B9,Inputs!$B$30:$B$54,Inputs!$F$30:$F$54)))-(G9+H9),Catch_Up_Limit-IF(A9=1,0,M8),Annual_Additions_Limit-IF(A9=1,0,Y8)-G9-H9),0)","v":0},{"$f":"SUM($L$2:L9)","v":0},0,{"$f":"SUM($N$2:N9)","v":0},{"$f":"MAX(IF(Excess_Plan_Elig=\"No\",0,(MIN(IFERROR((G9+H9+L9+IF(Excess_Plan_Elig=\"No\",0,MAX(C9*(_xlfn.XLOOKUP(B9,Inputs!$B$30:$B$54,Inputs!$D$30:$D$54)+IF((Prior_Yr_HCE_Indic=\"Yes\")*(_xlfn.XLOOKUP(B9,Inputs!$B$30:$B$54,Inputs!$D$30:$D$54)>0)*(M9>0),0,_xlfn.XLOOKUP(B9,Inputs!$B$30:$B$54,Inputs!$F$30:$F$54)))-(G9+H9)-L9,0)))/C9,0),Match_Tier_1)*Match_Tier_1_Perc*C9))-N9,0)","v":0},{"$f":"SUM($P$2:P9)","v":0},0,0,0,{"$f":"SUM($T$2:T9)","v":0},0,{"$f":"MIN(_xlfn.XLOOKUP(B9,Inputs!$B$30:$B$54,Inputs!$H$30:$H$54)*F9,Annual_Additions_Limit-IF(A9=1,0,Y8)-G9-H9-L9-N9-T9)","v":0},{"$f":"SUM($W$2:W9)","v":0},0]
[8,46142,0,{"$f":"SUM($C$2:C10)","v":0},0,0,{"$f":"MIN(_xlfn.XLOOKUP(B10,Inputs!$B$30:$B$54,Inputs!$D$30:$D$54)*F10,Deferral_Limit-IF(A10=1,0,I9),Annual_Additions_Limit-IF(A10=1,0,Y9))","v":0},{"$f":"MIN(_xlfn.XLOOKUP(B10,Inputs!$B$30:$B$54,Inputs!$F$30:$F$54)*F10,Deferral_Limit-IF(A10=1,0,I9)-G10,Annual_Additions_Limit-IF(A10=1,0,Y9)-G10)","v":0},{"$f":"SUM($G$2:H10)","v":0},{"$f":"IF(Prior_Yr_HCE_Indic=\"Yes\",0,MIN(_xlfn.XLOOKUP(B10,Inputs!$B$30:$B$54,Inputs!$D$30:$D$54)*F10-G10,M10-IF(A10=1,0,M9)))","v":0},0,{"$f":"MAX(MIN(F10*(_xlfn.XLOOKUP(B10,Inputs!$B$30:$B$54,Inputs!$D$30:$D$54)+IF((Prior_Yr_HCE_Indic=\"Yes\")*(_xlfn.XLOOKUP(B10,Inputs!$B$30:$B$54,Inputs!$D$30:$D$54)>0),0,_xlfn.XLOOKUP(B10,Inputs!$B$30:$B$54,Inputs!$F$30:$F$54)))-(G10+H10),Catch_Up_Limit-IF(A10=1,0,M9),Annual_Additions_Limit-IF(A10=1,0,Y9)-G10-H10),0)","v":0},{"$f":"SUM($L$2:L10)","v":0},0,{"$f":"SUM($N$2:N10)","v":0},{"$f":"MAX(IF(Excess_Plan_Elig=\"No\",0,(MIN(IFERROR((G10+H10+L10+IF(Excess_Plan_Elig=\"No\",0,MAX(C10*(_xlfn.XLOOKUP(B10,Inputs!$B$30:$B$54,Inputs!$D$30:$D$54)+IF((Prior_Yr_HCE_Indic=\"Yes\")*(_xlfn.XLOOKUP(B10,Inputs!$B$30:$B$54,Inputs!$D$30:$D$54)>0)*(M10>0),0,_xlfn.XLOOKUP(B10,Inputs!$B$30:$B$54,Inputs!$F$30:$F$54)))-(G10+H10)-L10,0)))/C10,0),Match_Tier_1)*Match_Tier_1_Perc*C10))-N10,0)","v":0},{"$f":"SUM($P$2:P10)","v":0},0,0,0,{"$f":"SUM($T$2:T10)","v":0},0,{"$f":"MIN(_xlfn.XLOOKUP(B10,Inputs!$B$30:$B$54,Inputs!$H$30:$H$54)*F10,Annual_Additions_Limit-IF(A10=1,0,Y9)-G10-H10-L10-N10-T10)","v":0},{"$f":"SUM($W$2:W10)","v":0},0]
{"$rows_left_out":18}
{"sheet":"Summary","index":4,"n_rows":34,"n_cols":5,"rows_kept":34,"cut":false,"hidden":false,"merged":[[27,0,27,4],[29,0,29,4],[31,0,31,4],[33,0,33,4]]}
["RSP & Excess Plan Benefit Summary"]
[{"$f":"\"Statement Printed \"&TEXT(TODAY(),\"mmmm d, yyyy\")","v":"Statement Printed January 15, 2026"}]
[]
["Participant Information",null,null,"Projected Totals"]
["Name:",{"$f":"Name","v":0},null,"Compensation"]
["Date of Hire:",{"$f":"TEXT(DOH,\"mmmm d, yyyy\")","v":"January 0, 1900"},null,"Uncapped Pay",{"$f":"Calculations!C27","v":0}]
["Date of Birth:",{"$f":"TEXT(DOB,\"mmmm d, yyyy\")","v":"January 0, 1900"},null,"401(a)(17) Limited Pay",{"$f":"Calculations!F27","v":0}]
["Excess Plan Eligible:",{"$f":"Excess_Plan_Elig","v":0}]
["Catch-up as Roth required:",{"$f":"Prior_Yr_HCE_Indic","v":0},null,"Employee Contributions"]
["Annual Compensation",null,null,"Before Tax Deferrals",{"$f":"Calculations!G27+Calculations!J27","v":0}]
{"$rows_left_out":24}